Boost failed updating 1 target

27-Dec-2015 12:33 by 8 Comments

Boost failed updating 1 target - Free adult cam chat eastbourne

It seems to have something to do with compiling using libstd and libc .const&, boost::regex_constants::error_type)in SFSWeb Client.o "boost::re_detail::get_default_error_string(boost::regex_constants::error_type)", referenced from: boost::re_detail::cpp_regex_traits_implementation const&, bool)in SFSWeb Client.o "_compress", referenced from: Sfs2X:: Util:: Byte Array:: Compress() in Byte Array.o "_uncompress", referenced from: Sfs2X:: Util:: Byte Array:: Uncompress() in Byte Array.old: symbol(s) not found for architecture x86_64collect2: ld returned 1 exit statusmake: *** [lib Smart Fox Client Api.dylib] Error 1FINALLY, I added zlib library to the linked libraries in eclipse, (adding z), and it finally built the API successfully.

Undefined symbols for architecture x86_64: "_compress", referenced from: Sfs2X:: Util:: Byte Array:: Compress() in Byte Array.o "_uncompress", referenced from: Sfs2X:: Util:: Byte Array:: Uncompress() in Byte Array.old: symbol(s) not found for architecture x86_64collect2: ld returned 1 exit statusmake: *** [lib Smart Fox Client Api.dylib] Error 1 const&, boost::regex_constants::error_type)in SFSWeb Client.o "boost::re_detail::get_default_error_string(boost::regex_constants::error_type)", referenced from: boost::re_detail::cpp_regex_traits_implementation const&, bool)in SFSWeb Client.o "_compress", referenced from: Sfs2X:: Util:: Byte Array:: Compress() in Byte Array.o "_uncompress", referenced from: Sfs2X:: Util:: Byte Array:: Uncompress() in Byte Array.old: symbol(s) not found for architecture x86_64collect2: ld returned 1 exit statusmake: *** [lib Smart Fox Client Api.dylib] Error 1hmm... When I was finally able to link the API lib to the Xcode project (Mac OS project), and compiled it successfully, the examples didn't work at all.You need something like: export CFLAGS="-O2 -pipe " This happens with the bjam shipped with boost 1.42 on linux with bash 4.0.35 (older bash versions were affected too).(In [60768]) Fix possible problems when trailing or leading whitespace is added to the env vars used, for example CC and CFLAGS when using the cc toolset.I have reached the exact same errors using the SFS API boost library.Everything is compiled nicely, but the linker freaks out and generates a huge error: Anyone knows how to resolve this??It was also reported that the problem occurs with LDFLAGS [1, comment 27].

[1] I can't seem to reproduce the problem on the latest bjam 3.1.18.Although I don't have access to a Gentoo system, so I'm only trying it on a Mac OSX bash.I don't see the extra "" in CFLAGS when I force the cc toolset. For some reason the CFLAGS in my steps to reproduce don't contain extra white spaces. First, the boost library wan't found, so I had to add /opt/local/include. Then, there was something ambiguious about the pow() function, I had to add two colons before that. Now, time to create an eclipse project, went through the steps (couldn't find the deploy directory, that should be excluded) and failed horribly. Then, I finally reached the linker errors, boost_system was not found.

  1. Sex chat rooms free webcam cybersex 27-Feb-2015 10:15

    At Connecting Singles we think you should spend your time connecting with quality singles - not trying to figure out where you are or how to use the site. ) and we think it should be easy for you to find them.